{"text_format":"1","workbook":"xlsx","n_sheets":12,"sheets":["Cover","Legacy","UI Controls","Interventions","Country Coding","GDP Annual Data (2005-13 Int$)","Regional Salaries (2005 Int$)","Int$ Conversion (2004-11)","FOM","Languages","Images","UserGuideExp"],"not_rendered":{"charts":17,"images":18,"macros":1,"external_links":0,"defined_names":8,"comments":0,"pivot_tables":0},"unopened":[],"bounds":{"document_bytes":16777216,"sheet_cells":100000,"rows_first":2000,"rows_last":500,"rows_between":2000,"halvings":0,"cell_chars":16384,"cell_head_chars":4096},"cells_cut":0,"cells_raw":0,"read":"whole","date_system":"1900"}

{"sheet":"Cover","index":0,"n_rows":7,"n_cols":3,"rows_kept":7,"cut":false,"hidden":false,"merged":[[1,1,2,11],[3,1,3,8],[6,2,6,8],[5,2,5,8],[4,1,4,8]]}
[]
[null,"Affordability Calculator for healthcare interventions \nto promote and assist tobacco cessation v1.8"]
[]
[null,"This tool allows you to calculate the affordability, using a WHO definition, of tobacco cessation interventions in your country. These estimates can then be used as a basis for considering which interventions to prioritise."]
[null,"Note: you may need to enable macros to run the tool. Click here for guidance go to http://bit.ly/ExcelMacros"]
[null,"\nFor more information:","The tool uses data from the accompanying international \nreview of efficacy and effectiveness and other standard sources:"]
[null,null,"West R, Raw M, McNeill A, Stead L, Aveyard P, Britton J, Stapleton J, McRobbie H, Pokhrel S, Lester-George, A, Borland R. Healthcare interventions to promote and assist tobacco cessation: a review of efficacy, effectiveness and affordability for use in national guideline development. 2014, manuscript in preparation."]

{"sheet":"Legacy","index":1,"n_rows":42,"n_cols":12,"rows_kept":42,"cut":false,"hidden":false,"merged":[[9,2,9,3],[10,2,10,3],[11,2,11,3],[12,2,12,3],[27,3,27,10],[17,2,17,3],[18,2,18,3],[43,2,43,4],[44,2,44,4],[33,3,33,10],[34,3,34,10],[35,3,35,10],[36,3,36,10],[40,3,40,10],[41,3,41,10],[37,3,37,10],[38,3,38,10],[39,3,39,10],[1,2,2,11],[4,5,4,6],[5,5,5,6],[4,2,4,3],[26,3,26,10],[19,2,19,3],[20,2,20,3],[21,2,21,3],[22,2,22,3],[23,2,23,3],[13,2,13,3],[14,2,14,3],[15,2,15,3],[16,2,16,3],[4,10,4,11],[6,4,7,10],[30,3,30,10],[31,3,31,10],[32,3,32,10],[28,3,28,10],[29,3,29,10]]}
[]
[null,null,"Affordability Calculator for healthcare interventions \nto promote and assist tobacco cessation v1.1 (Excel Legacy view)"]
[]
[]
[null,null,"Country:",null,"Income category:","Region:",null,"Per capita GDP:","Physician salary:",null,"Other Health Worker salary:"]
[null,null,null,null,{"$f":"IFERROR(VLOOKUP('UI Controls'!B1,'Country Coding'!A:F,6,0),\"\")","v":""},{"$f":"IFERROR(VLOOKUP('UI Controls'!B2,'Country Coding'!$E:$J,6,0),\"\")","v":""},null,{"$f":"IFERROR('UI Controls'!B4,\"\")","v":9928.0380984059466},{"$f":"IFERROR('UI Controls'!B7,\"\")","v":65194},{"$f":"IFERROR('UI Controls'!C7,\"\")","v":97.014880952380935},{"$f":"IFERROR('UI Controls'!B8,\"\")","v":40265},{"$f":"IFERROR('UI Controls'!C8,\"\")","v":59.918154761904759}]
[null,null,null,null,"Enter a comment if you wish",null,null,null,null,null,null,"ICER at unity:"]
[null,null,null,null,null,null,null,null,null,null,null,{"$f":"IFERROR('UI Controls'!B5,\"\")","v":130}]
[]
[null,null,"Intervention",null,"Effect \n(%pt increase in 12-month \nsuccess rates)","Physician hrs","Other health worker hrs","Unit manpower cost (international dollars)","Unit materials/drug cost","Total cost (international dollars)","ICER","Affordability: >1=affordable"]
[1,null,"Brief advice",null,2,0.6,0,{"$f":"F11*'UI Controls'!C7+G11*'UI Controls'!C8","v":58.208928571428558},{"$f":"SUMIFS(OFFSET(Interventions!$A:$A,0,MATCH(I$10,Interventions!$1:$1,0)-1),Interventions!$C:$C,$A11,Interventions!$A:$A,CurrentCountry)","v":0},{"$f":"SUM(H11:I11)","v":58.208928571428558},{"$f":"L8*J11/E11","v":3783.5803571428564},{"$f":"IFERROR('UI Controls'!$B$4/K11,0)","v":2.6239797126716859}]
[2,null,"Behavioural support: in person",null,4,0,3,{"$f":"F12*'UI Controls'!C7+G12*'UI Controls'!C8","v":179.75446428571428},{"$f":"SUMIFS(OFFSET(Interventions!$A:$A,0,MATCH(I$10,Interventions!$1:$1,0)-1),Interventions!$C:$C,$A12,Interventions!$A:$A,CurrentCountry)","v":0},{"$f":"SUM(H12:I12)","v":179.75446428571428},{"$f":"L8*J12/E12","v":5842.0200892857138},{"$f":"IFERROR('UI Controls'!$B$4/K12,0)","v":1.6994186850904545}]
[3,null,"Behavioural support: telephone",null,3,0,2,{"$f":"F13*'UI Controls'!C7+G13*'UI Controls'!C8","v":119.83630952380952},{"$f":"SUMIFS(OFFSET(Interventions!$A:$A,0,MATCH(I$10,Interventions!$1:$1,0)-1),Interventions!$C:$C,$A13,Interventions!$A:$A,CurrentCountry)","v":0},119.83630952380952,{"$f":"L8*J13/E13","v":5192.9067460317456},{"$f":"IFERROR('UI Controls'!$B$4/K13,0)","v":1.9118460207267611}]
[4,null,"Text messaging",null,4,0,0,{"$f":"F14*'UI Controls'!C7+G14*'UI Controls'!C8","v":0},{"$f":"SUMIFS(OFFSET(Interventions!$A:$A,0,MATCH(I$10,Interventions!$1:$1,0)-1),Interventions!$C:$C,$A14,Interventions!$A:$A,CurrentCountry)","v":0},0,{"$f":"L8*J14/E14","v":0},{"$f":"IFERROR('UI Controls'!$B$4/K14,0)","v":0}]
[5,null,"Printed materials",null,2,0,0.2,{"$f":"F15*'UI Controls'!C7+G15*'UI Controls'!C8","v":11.983630952380953},{"$f":"SUMIFS(OFFSET(Interventions!$A:$A,0,MATCH(I$10,Interventions!$1:$1,0)-1),Interventions!$C:$C,$A15,Interventions!$A:$A,CurrentCountry)","v":0},11.983630952380953,{"$f":"L8*J15/E15","v":778.93601190476193},{"$f":"IFERROR('UI Controls'!$B$4/K15,0)","v":12.745640138178407}]
{"$rows_left_out":28}
{"sheet":"UI Controls","index":2,"n_rows":12,"n_cols":4,"rows_kept":12,"cut":false,"hidden":false,"merged":[]}
["Current Country"]
["Current WHO subregion"]
["Current GDP Year","2013"]
["Current GDP",9928.0380984059466]
["ICER at unity",130]
["Inflator",1.25]
["Current Physician Salary",65194,{"$f":"B7/48/35*2*$B$6","v":97.014880952380935},"(Annual | Hourly)"]
["Current Nurse Salary",40265,{"$f":"B8/48/35*2*$B$6","v":59.918154761904759},"(Annual | Hourly)"]
["Sheets Unlocked",-1]
["Current Currency","$"]
["Conversion Factor",1]
["Language","English"]

{"sheet":"Interventions","index":3,"n_rows":157,"n_cols":9,"rows_kept":157,"cut":false,"hidden":false,"merged":[]}
["Country","Intervention","IndNo","Effect","Physician hrs","Other health worker hrs",null,"Unit materials/drug cost"]
["BRA","Brief advice",1,2,0.6,0,0,0,"Brazil"]
["BRA","Behavioural support: in person",2,4,0,3,null,0,"Brazil"]
["BRA","Behavioural support: telephone",3,3,0,2,null,0,"Brazil"]
["BRA","Text messaging",4,4,0,0,null,10,"Brazil"]
["BRA","Printed materials",5,2,0,0.2,null,10,"Brazil"]
["BRA","Single form NRT",6,6,0.6,0,null,150,"Brazil"]
["BRA","Bupropion",7,7,1,0,null,100,"Brazil"]
["BRA","Nortriptyline",8,10,2,0,null,20,"Brazil"]
["BRA","Varenicline",9,15,1,0,null,300,"Brazil"]
["BRA","Cytisine",10,6,0.6,0,null,20,"Brazil"]
["BRA","In person support+ single NRT",11,10,0.6,4,null,150,"Brazil"]
["BRA","Dual NRT",12,11,0.6,0,null,300,"Brazil"]
["BRA","In person support+ dual NRT",13,21,0.6,4,null,300,"Brazil"]
["CHN","Brief advice",1,2,0.6,0,null,0,"China"]
{"$rows_left_out":143}
{"sheet":"Country Coding","index":4,"n_rows":216,"n_cols":10,"rows_kept":216,"cut":false,"hidden":false,"merged":[]}
["Country Code","Country Name","WHO Region Code","WHO Region Name","WHO Subregion","Income Level","CURRENCY","SYMBOL","Currency Name"]
["AFG","Afghanistan","EMR","Eastern Mediterranean","EMRO D","Low","AFN","AFN","Afghanis","Eastern Med (D)"]
["ALB","Albania","EUR","European","EURO B","Upper middle","ALL","Lek","Albanian Leks","European (B)"]
["DZA","Algeria","AFR","African","AFRO D","Upper middle","","","","African (D)"]
["ASM","American Samoa","RESIDUAL","Residual","RESIDUAL","Upper middle","","",""]
["AND","Andorra","EUR","European","EURO A","High","","","","European (A)"]
["AGO","Angola","AFR","African","AFRO D","Upper middle","","","","African (D)"]
["ATG","Antigua & Barbuda","AMR","Americas","AMRO B","High","","","","Americas (B)"]
["ARG","Argentina","AMR","Americas","AMRO B","Upper middle","ARS","$","Argentinian Pesos","Americas (B)"]
["ARM","Armenia","EUR","European","EURO B","Lower middle","","","","European (B)"]
["ABW","Aruba","RESIDUAL","Residual","RESIDUAL","High","","",""]
["AUS","Australia","WPR","Western Pacific","WPRO A","High","AUD","$","Australian Dollars","W. Pacific (A)"]
["AUT","Austria","EUR","European","EURO A","High","EUR","€","Euros","European (A)"]
["AZE","Azerbaijan","EUR","European","EURO B","Upper middle","AZN","AZN","Azerbaijani New Manats","European (B)"]
["BHS","Bahamas","AMR","Americas","AMRO B","High","BSD","$","Bahamas Dollars","Americas (B)"]
{"$rows_left_out":202}
{"sheet":"GDP Annual Data (2005-13 Int$)","index":5,"n_rows":263,"n_cols":14,"rows_kept":263,"cut":false,"hidden":false,"merged":[]}
["Country Code","Country Name","2005","2006","2007","2008","2009","2010","2011","2012","2013"]
["ABW","Aruba",23302.831988005506,24015.420612270114,25921.282140539228,27549.345731910609,24639.935326015646,24289.141516132615,25354.782474108601]
["AND","Andorra",31268.966744979545,34484.70086377472,39922.89012104139,46418.415467327795]
["AFG","Afghanistan",252.40789247684927,275.35094090477367,373.59141621851455,376.97766986885364,450.65923904499414,561.19761748479527,613.9791915994623,687.58136771520469,678.34788813288969,"EMR","EMRO D","Low"]
["AGO","Angola",1706.5436158078687,2440.6317161064258,3412.7189979656414,4596.268430943147,3988.6835572765171,4218.6491255737947,5159.2336660399651,5539.3469320952263,5668.1167988245734,"AFR","AFRO D","Low"]
["ALB","Albania",2798.9496326700664,3076.9798440008794,3638.7108130403903,4422.6924459822176,4175.7793489637124,4175.120239265354,4556.1443416520433,4406.116378416883,4652.3513950621846,"EUR","EURO B","Lower middle"]
["ANR","Andean Region"]
["ARB","Arab World",3795.8702407855426,4410.8463445165735,5045.495910405195,6253.28417356303,5268.4092866561532,6060.8312191160549,7042.957135880205,7626.6697163598674,7709.9491885501493]
["ARE","United Arab Emirates",43533.891782230668,45554.219403978801,44488.649858533041,46402.644768859682,33012.815119948144,34048.51734533158,39057.837057180775,41691.695033942553,null,"EMR","EMRO B","High"]
["ARG","Argentina",5767.6570119761927,6783.7139746898465,8384.1877122817059,10232.959080990169,9456.8163136556377,11460.376147593262,13693.703786572354,14679.925235162829,14715.18001939026,null,"",""]
["ARM","Armenia",1625.3969042944348,2126.0895659070979,3079.1521874094678,3916.7381073829042,2913.5741433857675,3124.7848541250419,3421.7045092460653,3353.973125131231,3504.7667584894675,"EUR","EURO B","Low"]
["ASM","American Samoa",null,null,null,null,null,null,null,null,null,null,"",""]
["ATG","Antigua and Barbuda",12135.541029277934,13675.08523871234,15276.126361009514,15787.032155120825,13977.940860907254,13017.499748438728,12785.155606645758,13406.169083228442,13668.944824137356,"AMR","AMRO B","Upper middle"]
["AUS","Australia",34011.73863566928,36113.002399710735,40996.317909386315,49672.748009190436,42721.884938451745,51824.798420203777,62080.982416173378,67435.954432742103,67468.068705161655,"WPR","WPRO A","High"]
["AUT","Austria",37067.323828674336,39299.6225118445,45181.498513592865,49679.131717927237,45872.198049174061,45016.703850033067,49485.482194813056,46792.16568763426,49053.822904486064,"EUR","EURO A","High"]
{"$rows_left_out":249}
{"sheet":"Regional Salaries (2005 Int$)","index":6,"n_rows":15,"n_cols":4,"rows_kept":15,"cut":false,"hidden":false,"merged":[]}
["Subregion","Physican Salary","Nurse Salary","Health Worker Salary"]
["AFRO D",20091,12409,9399]
["AFRO E",19892,12285,9306]
["AMRO A",78977,48777,36946]
["AMRO B",25945,16024,12137]
["AMRO D",20054,12386,9382]
["EMRO B",65194,40265,30498]
["EMRO D",4934,3047,2308]
["EURO A",100201,61885,46875]
["EURO B",26254,16215,12282]
["EURO C",21346,13184,9986]
["SEARO B",11743,7253,5493]
["SEARO D",16388,10121,7666]
["WPRO A",66873,41302,31284]
["WPRO B",23368,14432,10932]
{"$rows_left_out":1}
{"sheet":"Int$ Conversion (2004-11)","index":7,"n_rows":185,"n_cols":9,"rows_kept":185,"cut":false,"hidden":false,"merged":[]}
["Code",2004,2005,2006,2007,2008,2009,2010,2011]
["AFG",15.41,16.71,16.75,19.05,22.51,19.600000000000001,21.77,22.3]
["ALB",56.21,55.65,54.33,55.08,54.81,54.76,56.52,57.36]
["DZA",39.51,38.74,38.4,38.700000000000003,39.090000000000003,41.47,42.4,42.96]
["AGO",59.28,70.5,77.39,84.46,91.48,104.41,117.59,129.35]
["ATG",2.09,2.0699999999999998,2.04,2.0099999999999998,2.04,2.04,2.0699999999999998,2.08]
["ARG",1.28,1.35,1.45,1.54]
["ARM",201.55,196.19,195.55,198.51,208.28,216.15,230.06,240.08]
["AUS",1.44,1.46,1.5,1.51,1.53,1.54,1.56,1.53]
["AUT",0.89,0.89,0.88,0.88,0.87,0.87,0.86,0.87]
["AZE",0.33,0.35,0.37,0.42,0.49,0.5,0.52,0.54]
["BHS",0.9,0.89,0.88,0.88,0.88,0.9,0.9,0.9]
["BHR",0.32,0.32,0.32,0.32,0.32,0.33,0.33,0.32]
["BGD",24.62,25.49,26.37,27.97,29.34,31.04,33.020000000000003,35.43]
["BRB",1.39,1.43,1.49,1.5,1.57,1.63,1.7,1.8]
{"$rows_left_out":171}
{"sheet":"FOM","index":8,"n_rows":30,"n_cols":3,"rows_kept":30,"cut":false,"hidden":true,"merged":[]}
[null,"English","Español"]
[1,"%pt increase in 12-month success rates.\nEffects for combinations involve adding effects for components","aumento pt% en las tasas de éxito de 12 meses.\r\nEfectos de combinaciones implican la adición de efectos de los componentes "]
[2,"ICER at unity = cost per life year gained per 1 percentage point increase in 6 month cessation rate in UK for 35-54 age group, if the incremental cost of implementation per smoker treated is $1. \n\nA 3.5% temporal discounting is applied. The data is from Stapleton et al. (2011).\n\nICER at unity may differ from country to country; we suggest to leave as is, unless you have good evidence that it is different, or want to do a sensitivity analysis. Higher ratios mean that stopping smoking is less beneficial in that country.","ICER en unidad = coste por año de vida ganado por aumento de 1 punto porcentual en la tasa de abandono del hábito de 6 meses en el Reino Unido para el grupo de edad 35-54, si el costo incremental de la aplicación por fumador tratado es de $ 1.\r\n\r\nSe aplica un descuento temporal 3,5%. Los datos provienen de Stapleton et al. (2011).\r\n\r\nICER en la unidad pueden diferir de un país a otro; le sugerimos dejar como está, a menos que tenga una buena evidencia de que es diferente, o quiere hacer un análisis de sensibilidad. Proporciones más altas indican que dejar de fumar es menos beneficioso en ese país ."]
[3,"The incremental cost-effectiveness ratio (ICER) is typically used in cost-effectiveness analyses. ICER is the ratio of the change in costs to incremental benefits of the intervention compared with the control. The equation for ICER is:\n\n       ICER = (C1 – C2) / (E1 – E2)\n\nwhere C1 and E1 are the cost and effect in the intervention group and where C2 and E2 are the cost and effect in the control group.","La Ratio Coste Efectividad Incremental (ICER) se suele utilizar en el análisis de costo-efectividad ICER es la relación entre la variación de los costos a los beneficios incrementales de la intervención, en comparación con el control de la ecuación para ICER es:\n\n        ICER = (C1 - C2) / (E1 - E2)\n\ndonde C1 y E1 son el costo y el efecto en el grupo de intervención y donde C2 y E2 son el costo y el efecto en el grupo de control"]
[4,{"$f":"CONCATENATE(\"Physician cost per hour is based on annual salary for a Medical Officer\",IF(CurrentCountry<>\"\",\" (WHO Region \"&'UI Controls'!B2&\" )\",\"\"),\", assuming 4 weeks paid holiday and 35 hour week, with 100% additional costs for accommodation, servicing and on-costs (2005 data).\",CHAR(10),CHAR(10),\"See http://www.who.int/choice/costs/prog_costs/ for more details.\")","v":"Physician cost per hour is based on annual salary for a Medical Officer, assuming 4 weeks paid holiday and 35 hour week, with 100% additional costs for accommodation, servicing and on-costs (2005 data).\n\nSee http://www.who.int/choice/costs/prog_costs/ for more details."},"Costo médico por hora se basa en el salario anual de un oficial médico, suponiendo 4 semanas de vacaciones pagadas y 35 horas semanales, con un 100% de los costos adicionales de alojamiento, mantenimiento y (datos de 2005) en los costos.\r\n\r\nVer http://www.who.int/choice/costs/prog_costs/ para más detalles ."]
[5,{"$f":"CONCATENATE(\"Other health worker cost per hour is based on annual salary for a Registered Nurse\",IF(CurrentCountry<>\"\",\" (WHO Region \"&'UI Controls'!B2&\" )\",\"\"),\", assuming 4 weeks paid holiday and 35 h week with 100% additional costs for accommodation, servicing and on-costs (2005 data).\",CHAR(10),CHAR(10),\"See http://www.who.int/choice/costs/prog_costs/ for more details.\")","v":"Other health worker cost per hour is based on annual salary for a Registered Nurse, assuming 4 weeks paid holiday and 35 h week with 100% additional costs for accommodation, servicing and on-costs (2005 data).\n\nSee http://www.who.int/choice/costs/prog_costs/ for more details."},"Otros costes por hora de los trabajadores de la salud se basa en el salario anual de una enfermera registrada, asumiendo 4 semanas de vacaciones pagadas y 35 h semanas con el 100% de los costos adicionales para el alojamiento, el servicio y sobre-costos (datos de 2005).\r\n\r\nVer http://www.who.int/choice/costs/prog_costs/ para más detalles ."]
[6,"Per capita GDP (2013) is taken from http://api.worldbank.org/v2/en/indicator/ny.gdp.pcap.pp.cd","El PIB per cápita (2013) se toma de http://api.worldbank.org/v2/en/indicator/ny.gdp.pcap.pp.cd"]
[7,"- Physician hours per treatment is based on estimated contact time plus 100% for training and additional administrative work\n\n- Physician time for medications is based on side-effect profile that would need managing","- Hora médicos por tratamiento se basa en la estimación de tiempo de contacto más el 100% para la formación y el trabajo administrativo adicional\r\n\r\n- Tiempo del médico para los medicamentos se basa en el perfil de efectos secundarios que habría que gesti"]
[8,"- Other Healrh Worker hours per treatment is based on estimated contact time plus 100% for training and additional administrative work","- Otros horas Healrh trabajadores por tratamiento se basa en la estimación de tiempo de contacto más el 100% para la formación y el trabajo administrativo adicional"]
[9,"MATERIALS / DRUG UNIT COST:\n- Medication costs are based on actual prices or projected prices if the drug were to be available derived from costs where currently available\n\n- Text messaging costs are based on telecon costs plus set up costs spread over large number of users and promotion\n\n- Internet costs are based on hosting costs plus texting costs plus set up costs spread over large number of users and promotion","COSTE MATERIALES UNIDAD / DROGAS:\r\n- El gasto en medicamentos se basan en los precios actuales o los precios proyectados si la droga fuera a estar disponible derivada de costos donde actualmente disponibles\r\n\r\n- Costes costos de los mensajes de texto se basan en los costos Telecon además establecieron extienden por gran número de usuarios y promoción\r\n\r\n- Los costos de Internet se basan en costes de hosting más mensajes de texto más costes de establecer los costos que se distribuyen en gran número de usuarios y la promoción "]
[10,"All costs are in international dollars - see conversion table: http://mdgs.un.org/unsd/mdg/SeriesDetail.aspx?srid=699\n\nAn international dollar has the same purchasing power in relation to gross domestic product as a US dollar has in the United States. Costs in local currency units are converted to international dollars using purchasing power parity (PPP) exchange rates. A PPP exchange rate is the number of units of a country's currency required to buy the same amounts of goods and services in the domestic market as US dollar would buy in the United States. An international dollar is, therefore, a hypothetical currency that is used as a means of translating and comparing costs from one country to the other using a common reference point, the US dollar. \n\nThe PPP exchange rates used in this analysis were developed by WHO.","Todos los costos son en dólares internacionales - ver tabla de conversión: http://mdgs.un.org/unsd/mdg/SeriesDetail.aspx?srid=699\r\n\r\nUn dólar internacional tiene el mismo poder adquisitivo en relación con el producto interno bruto como un dólar estadounidense en los Estados Unidos. Los costos en unidades de moneda local se convierten a dólares internacionales utilizando las tasas de cambio de paridad del poder adquisitivo (PPA). Un tipo de cambio PPP es el número de unidades de la moneda de un país es necesario para comprar la misma cantidad de bienes y servicios en el mercado nacional como dólar compraría en los Estados Unidos. Un dólar internacional es, por lo tanto, una moneda hipotética que se utiliza como un medio de la traducción y la comparación de los costos de un país a otro utilizando un punto de referencia común, el dólar estadounidense.\r\n\r\nLos tipos de cambio PPA utilizados en este análisis fueron desarrollados por la OMS ."]
[11,"Name of WHO region","Nombre de la región de la OMS"]
[13,"World Bank income category (July 2014, see http://siteresources.worldbank.org/DATASTATISTICS/Resources/CLASS.XLS)","Banco Mundial categoría de ingresos (julio de 2014, ver http://siteresources.worldbank.org/DATASTATISTICS/Resources/CLASS.XLS)"]
[12,"Total combined cost of healthcare worker time (physician and other healthcare worker) required for intervention delivery; we recommend you use these figures unless you have better local data","Costo total combinado de tiempo de los trabajadores de la salud (médicos y otros trabajadores de la salud) requerido para la entrega de intervención; le recomendamos que utilice estas cifras a menos que tenga mejores datos locales"]
[15,"Total combined cost of labour and drugs/materials required for intervention delivery","Costo total combinado de trabajo y drogas / materiales necesarios para la entrega de intervención"]
{"$rows_left_out":16}
{"sheet":"Languages","index":9,"n_rows":70,"n_cols":3,"rows_kept":70,"cut":false,"hidden":false,"merged":[]}
["Label name","English","Español"]
["lbl_Tile_3","ABOUT","ACERCA"]
["tmp_3","ABOUT","ACERCA"]
["Label49","Acknowledgements:","Agradecimientos:"]
["FOM_16","Affordability","Asequibilidad"]
["lbl_Tile_2","AFFORDABILITY CALCULATOR","ASEQUIBILIDAD CALCULADORA"]
["tmp_2","AFFORDABILITY CALCULATOR","ASEQUIBILIDAD CALCULADORA"]
["lbl_MainTitle","Affordability Calculator for healthcare interventions \nto promote and assist tobacco cessation v1.8","Asequibilidad Calculadora para las intervenciones de salud\npromover y ayudar a dejar el tabaco v1.8"]
["lbl_Currency","All costs are in International Dollars.","Todos los gastos están en dólares internacionales."]
["lbl_Int_02","Behavioural support: in person","Apoyo conductual en persona"]
["lbl_Int_03","Behavioural support: telephone","Apoyo conductual teléfono"]
["lbl_EQ1","Brazil","Brasil"]
["lbl_Int_01","Brief advice","El consejo breve"]
["lbl_Int_07","Bupropion","Bupropion"]
["lbl_EQ2","China","China"]
{"$rows_left_out":56}
{"sheet":"Images","index":10,"n_rows":0,"n_cols":0,"rows_kept":0,"cut":false,"hidden":true,"merged":[]}

{"sheet":"UserGuideExp","index":11,"n_rows":45,"n_cols":1,"rows_kept":45,"cut":false,"hidden":true,"merged":[]}
["Affordability Calculator for healthcare interventions\nto promote and assist tobacco cessation v1.1"]
[]
["User Guide"]
[]
["USING THE CALCULATOR"]
[]
["The tool presents treatment effectiveness based on the scientific literature (see accompanying review), physician or other health worker time expected to be taken to deliver the intervention and cost data taken from standard sources (see notes). All terms, assumptions and units are also explained in the notes. All costs are converted into international dollars using a standard formula. Furtehr guidance and notes are available by clicking on blue labels."]
[]
["Values in grey fields are locked and cannot be changed. Everything else can be amended if you have better data. We recommend that you do not change the default effect sizes, which are based on our review and the Cochrane reviews, unless you have better data."]
[]
["When data are updated, the tool calculates an affordability index. If the figure comes out at 1 or greater the intervention should be affordable in your country. The higher the number the more affordable it is. Unaffordable interventions are highlighted in red."]
[]
["The details have been pre-populated for a number of countries and these can be selected from the bottom. You can also select ‘Other’ to select a different country or define your own custom area; a variety of options are available:"]
[]
["1. Country - most world countries can be selected from the drop down menu."]
{"$rows_left_out":30}